Year,Jurisdiction,Jur_Name,Parcel_ID,Account,Location_Code,Jur1,Jur2,Jur 3,Jur 4,Jur 5,Jur 6,Jur 7,Jur 8,Jur 9,Jur 10,Jur 11,Jur 12,Is_Exempt,Prop_Street_Number,Prop_Street,Prop_Street_Dir,Prop_City,Prop_State,Prop_Zip5,Prop_Zip4,Owner_Id,Owner_Prefix,Name,Careof,Street,Street_Overflow,City,State,Zip5,Zip4,Interest,Ceiling_Year,Ceiling_Tax,Homestead_Code,Agent_Code,Acres,Legal1,Legal2,Legal3,Mortgage_Code,Land_Hs,Land_Nhs,Land_Productivity_Market,Land_1d1,Land_1d,Land_Timber,Personal_Hs,Personal_Nhs,Market_Value,Net_Taxable_Value,State_Homestead,State_Mandated_Over65,State_Mandated_Disabled,Optional65,Local_Disabled,Road_Homestead,Disabled_Veteran,New_Personal_Hs,New_Personal_Nhs,Improvement_Hs,New_Improvement_Hs,Improvement_Nhs,New_Improvement_Nhs,Is_Owner_Confidential,Local_Discount,Map1,Map2,Ownership_Sequence,Is_Protested,Has_Hs_Link,Primary_Category_Code,Secondary_Category_Code,Third_Category_Code,DBA,Has_Abatement,Has_Miscellaneous_Exemption,Name1,Legal4
2019,00,PECOS COUNTY APPR DIST,3,01680-00100-01000-001130,16M,00,01,31,10,63,,,MCP,,,,,False,735,US HWY 285,S,FORT STOCKTON,TX,79735,,28592,R,HOMER HOMES LLC,,735 S US HWY 285,,FORT STOCKTON,TX,79735,,1.000000,0,0.00,,,0.0000,LOCATED MOBILE HOME,ROAD RUNNER RV PARK,SPOT # 78,,0,0,0,0,0,0,0,0,10490,10490,0,0,0,0,0,0,0,0,0,0,0,10490,0,False,0,,,1,False,False,M1,,,,False,False,,SAN ANTONIO
2019,00,PECOS COUNTY APPR DIST,4,01680-00100-01000-001156,16M,00,01,31,10,63,,,MCP,,,,,False,735,US HWY 285,S,FORT STOCKTON,TX,79735,,28592,R,HOMER HOMES LLC,,735 S US HWY 285,,FORT STOCKTON,TX,79735,,1.000000,0,0.00,,,0.0000,LOCATED MOBILE HOME,ROAD RUNNER RV PARK,SPOT #108,,0,0,0,0,0,0,0,0,3910,3910,0,0,0,0,0,0,0,0,0,0,0,3910,0,False,0,,,1,False,False,M1,,,,False,False,,SAN JACINTO
2019,00,PECOS COUNTY APPR DIST,8,00001-08015-06210-001240,18M,00,01,31,63,,,,MCP,,,,,False,1727,48 LANE,E,FORT STOCKTON,TX,79735,,536,R,BASSHAM JOE,,1305 W 45TH LANE,,FT STOCKTON,TX,79735,9610,1.000000,0,0.00,,,0.0000,LOCATED    MOBILE HOME,W/2 -62,BLK 1 FSIL,,0,0,0,0,0,0,0,0,9540,9540,0,0,0,0,0,0,0,0,0,9540,0,0,0,False,0,,,1,False,False,M1,,,,False,False,,SEC 15
2019,00,PECOS COUNTY APPR DIST,10,00011-02119-00100-001278,12M,00,01,30,63,,,,MCP,,,,,False,,SUN VALLEY FARM,,,,,,894,R,BRADLEY BARBARA,,P O BOX 944,,MCCAMEY,TX,79752,,1.000000,0,0.00,,,0.0000,LOCATED        MOBILE HOME,BLK 11         H&GN,SEC 119,,0,0,0,0,0,0,0,0,20370,20370,0,0,0,0,0,0,0,0,0,0,0,20370,0,False,0,,,1,False,False,M1,,,,False,False,,
2019,00,PECOS COUNTY APPR DIST,11,00000-00318-01300-001279,18M,00,01,31,63,,,,MCP,,,,,False,294,BISHOP,E,FORT STOCKTON,TX,79735,,27376,R,SANCHEZ NYLDA ARMENDARIZ,,816 S MAIN,,FORT STOCKTON,TX,79735,,1.000000,0,0.00,,,0.0000,LOCATED   MOBILE HOME,TK-13,BODIE TOWN,,0,0,0,0,0,0,0,0,14440,14440,0,0,0,0,0,0,0,0,0,14440,0,0,0,False,0,,,1,False,False,M1,,,,False,False,,
2019,00,PECOS COUNTY APPR DIST,12,00001-08009-06301-000000,18M,00,01,31,63,,,,MCP,,,,,False,,44 LANE,,FORT STOCKTON,TX,79735,,858,R,BOWLES CHARLES R JR,,P O BOX 714,,FT STOCKTON,TX,79735,0714,1.000000,0,0.00,H,,0.6230,PT TR 63   1  FSIL  SEC 9,SE,,,410,0,0,0,0,0,0,0,11140,11140,0,0,0,0,0,0,0,0,0,10730,0,0,0,False,0,,,1,False,False,A2,,,,False,False,,
2019,00,PECOS COUNTY APPR DIST,14,00008-00017-01000-001339,12M,00,01,30,63,,,,MCP,,,,,False,,HWY 1450,,COYANOSA,TX,79730,,893,R,BRADEN KELLEY,ALVIN BRADEN,P O BOX 127,,COYANOSA,TX,79730,0127,1.000000,0,0.00,H,,0.0000,LOCATED        MOBILE HOME,BLK 8   H&GN  SEC 17,,,0,0,0,0,0,0,0,0,20180,20180,0,0,0,0,0,0,0,0,0,18980,1200,0,0,False,0,,,1,False,False,M1,,,,False,False,,
2019,00,PECOS COUNTY APPR DIST,15,00001-03063-00900-001352,21M,00,01,32,12,63,65,,MCP,,,,,False,,UNDERWOOD,,IRAAN,TX,79744,,495,R,BARRERA,"CONTRACTORS, INC",P O BOX 1103,,IRAAN,TX,79744,1103,1.000000,0,0.00,,,0.0000,LOCATED       OFFICE ONLY,INDUSTRIAL PARK,,,0,0,0,0,0,0,0,0,335480,335480,0,0,0,0,0,0,0,0,0,0,0,335480,0,False,0,,,1,False,False,M1,,,,False,False,,
2019,00,PECOS COUNTY APPR DIST,16,01742-00200-06000-001353,18M,00,01,31,63,,,,MCP,,,,,False,2513,PARKVIEW,,FORT STOCKTON,TX,79735,,26102,R,GLADDEN CARLIE JO,,P O BOX 92,,FT STOCKTON,TX,79735,,1.000000,0,0.00,,,0.0000,LOCATED   MOBILE HOME,6  2  QUAIL RUN 2ND FILING,,,0,0,0,0,0,0,0,0,10690,10690,0,0,0,0,0,0,0,0,0,10690,0,0,0,False,0,,,1,False,False,M1,,,2.14 QUAIL RUN 2ND FOR 2005,False,False,,
2019,00,PECOS COUNTY APPR DIST,18,00146-00017-09500-001460,18M,00,01,31,63,,,,MCP,,,,,False,550,40 LANE,W,FORT STOCKTON,TX,79735,,1160,R,CALDERON JOE,,550 W 40TH LANE,,FT STOCKTON,TX,79735,8953,1.000000,0,0.00,H,,0.0000,LOCATED    MOBILE HOME,PT-30,BLK 146     SEC 17,,0,0,0,0,0,0,0,0,8070,8000,0,0,0,0,0,0,0,0,0,8070,0,0,0,False,0,,,1,False,False,M1,,,,False,False,,LITTLE MEXICO
2019,00,PECOS COUNTY APPR DIST,20,00194-00003-01000-001506,24M,00,01,32,63,65,,,MCP,,,,,False,,,,IRAAN,TX,79744,,26660,R,WEST OIL RESOURCES LLC,,106 DEEP LAKE DR,,LIBERTY HILL,TX,78642,,1.000000,0,0.00,,,0.0000,LOCATED        SHOP & M/H,BLK 194        SEC 3,,,0,0,0,0,0,0,0,0,48690,48690,0,0,0,0,0,0,0,0,0,0,0,48690,0,False,0,,,1,False,False,E2,,,,False,False,,
2019,00,PECOS COUNTY APPR DIST,28,00117-00003-05400-001892,18M,00,01,31,63,,,,MCP,,,,,False,,LAMAR,,FORT STOCKTON,TX,79735,,27571,R,VILLARREAL AUDEN BAEZA,,208 S COLPITTS ST,,FT STOCKTON,TX,79735,,1.000000,0,0.00,,,0.0000,LOCATED   MOBILE HOME,TR 54     ALAMO RANCHETTES,,,0,0,0,0,0,0,0,0,8120,8120,0,0,0,0,0,0,0,0,0,0,0,8120,0,False,0,,,1,False,False,M1,,,,False,False,,
2019,00,PECOS COUNTY APPR DIST,31,00146-00017-01101-002075,18M,00,01,31,63,,,,MCP,,,,,False,4257,JACKSON,N,FORT STOCKTON,TX,79735,,2512,R,ESPARZA EDWARD,,4221 N JACKSON,,FT STOCKTON,TX,79735,9446,1.000000,0,0.00,,,0.0000,LOCATED    MOBILE HOME,3709        PT-2C,BLK 146     LITTLE MEXICO,,0,0,0,0,0,0,0,0,15390,15390,0,0,0,0,0,0,0,0,0,0,0,15390,0,False,0,,,1,False,False,M1,,,,False,False,,SEC 17
2019,00,PECOS COUNTY APPR DIST,36,02120-03800-03000-002182,24M,00,01,32,63,65,,,MCP,,,,,False,,PINE,,SHEFFIELD,TX,79781,,2695,R,FLORES ARMANDO R ETUX,,P O BOX 294,,SHEFFIELD,TX,79781,0294,1.000000,0,0.00,,,0.0000,LOCATED   MOBILE HOME,4,38,,0,0,0,0,0,0,0,0,3160,3160,0,0,0,0,0,0,0,0,0,0,0,3160,0,False,0,,,1,False,False,M1,,,,False,False,,SHEFFIELD
2019,00,PECOS COUNTY APPR DIST,38,01460-02100-04003-002206,16M,00,01,31,10,63,,,MCP,,,,,False,689,MOCKINGBIRD,,FORT STOCKTON,TX,79735,,4535,R,BARRAGAN DEBBIE ETVIR LINO,,P O BOX 862,,FT STOCKTON,TX,79735,,1.000000,0,0.00,,,0.0000,LOCATED    MOBILE HOME,LOT 4,BLK 21,,0,0,0,0,0,0,0,0,8770,8770,0,0,0,0,0,0,0,0,0,0,0,8770,0,False,0,,,1,False,False,M1,,,,False,False,,MESA VIEW
2019,00,PECOS COUNTY APPR DIST,41,00117-00002-03900-02230,18M,00,01,31,63,,,,MCP,,,,,False,,,,FORT STOCKTON,TX,79735,,3053,R,GARCIA LARRY EST,,603 ARNETT,,FT STOCKTON,TX,79735,4725,1.000000,0,0.00,,,0.0000,LOCATED    MOBILE HOME,TR 20,W R CHANCELLOR,,0,0,0,0,0,0,0,0,3170,3170,0,0,0,0,0,0,0,0,0,0,0,3170,0,False,0,,,1,False,False,M1,,,,False,False,,SEC 2
2019,00,PECOS COUNTY APPR DIST,53,00194-00003-01000-002376,24M,00,01,32,63,65,,,MCP,,,,,False,,FM 349,,IRAAN,TX,79744,,3569,R,GRIGSBY RANDY,,P O BOX 235,,IRAAN,TX,79744,0235,1.000000,0,0.00,H,,0.0000,LOCATED MOBILE HOME,BLK 194   SEC 3,,,0,0,0,0,0,0,0,0,54930,54930,0,0,0,0,0,0,0,0,0,54930,0,0,0,False,0,,,1,False,False,E2,,,,False,False,,
2019,00,PECOS COUNTY APPR DIST,59,00018-00011-00100-002541,24M,00,01,32,63,65,,,MCP,,,,,False,,,,,,,,3778,R,HARTMAN RANDAL,,HCR 73 BOX 22,,MC CAMEY,TX,79752,9701,1.000000,0,0.00,H,,0.0000,LOCATED  MOBILE HOME,BLK 18   UNIVERSITY LAND,SEC 11,,0,0,0,0,0,0,0,0,47420,47420,0,0,0,0,0,0,0,0,0,47420,0,0,0,False,0,,,1,False,False,M1,,,,False,False,,
2019,00,PECOS COUNTY APPR DIST,61,01600-26700-03000-002633,16M,00,01,31,10,63,,,MCP,,,,,False,1506,WILLIAMS,N,FORT STOCKTON,TX,79735,,3865,R,HENDERSON MARVIN J,ETUX GRACE L,2038 E 51 ST LANE,,FT STOCKTON,TX,79735,9584,1.000000,0,0.00,,,0.0000,LOCATED MOBILE HOME,LOT 3 BLK 267 ORIENT,,,0,0,0,0,0,0,0,0,4290,4290,0,0,0,0,0,0,0,0,0,4290,0,0,0,False,0,,,1,False,False,M1,,,,False,False,,
2019,00,PECOS COUNTY APPR DIST,63,01600-18800-06000-002660,16M,00,01,31,10,63,,,MCP,,,,,False,903,ELEVENTH,E,FORT STOCKTON,TX,79735,,3953,R,VESTAL SUSIE I,,P O BOX 520,,FT STOCKTON,TX,79735,0370,1.000000,0,0.00,,,0.0000,LOCATED        MOBILE HOME,E52 FT- 5    188   ORIENT,& E52 FT-6,,0,0,0,0,0,0,0,0,10700,10700,0,0,0,0,0,0,0,0,0,10700,0,0,0,False,0,,,1,False,False,M1,,,,False,False,,
2019,00,PECOS COUNTY APPR DIST,68,00000-00000-02771-000000,18M,00,01,31,63,,,,MCP,,,,,False,4888,WEATHERBY RD,,COYANOSA,TX,79730,,890,R,BRADEN DENNIS,,P O BOX 146,,COYANOSA,TX,79730,0146,1.000000,0,0.00,,,0.0000,LOCATED  MOBILE HOME,SEC 11 BLK 48-8 COYANOSA,,,0,0,0,0,0,0,0,0,4290,4290,0,0,0,0,0,0,0,0,0,0,0,4290,0,False,0,,,1,False,False,M1,,,,False,False,,
2019,00,PECOS COUNTY APPR DIST,74,00194-00002-00100-002972,24M,00,01,32,63,65,,,MCP,,,,,False,649,PRIVATE RD 8601,,IRAAN,TX,79744,,4601,R,KIMBROUGH B D,,P O BOX 583,,IRAAN,TX,79744,0752,1.000000,0,0.00,H,,0.0000,LOCATED        MOBILE HOME,BLK 194        SEC 2,,,0,0,0,0,0,0,0,0,62120,62120,0,0,0,0,0,0,0,0,0,62120,0,0,0,False,0,,,1,False,False,M1,,,,False,False,,
2019,00,PECOS COUNTY APPR DIST,78,01600-23400-04000-003150,16M,00,01,31,10,63,,,MCP,,,,,False,809,TWELFTH ST,E,FORT STOCKTON,TX,79735,,4807,R,LEDFORD NELDA,,BOX 194,,FT STOCKTON,TX,79735,0194,1.000000,0,0.00,H,,0.0000,LOCATED        MOBILE HOME,YUCCA  BLAIR HOUSE MH PK,SP 15,,0,0,0,0,0,0,0,0,6050,5520,0,0,0,0,0,0,0,0,0,6050,0,0,0,False,0,,,1,False,False,M1,,,,False,False,,
2019,00,PECOS COUNTY APPR DIST,87,00165-00001-01000-003373,18M,00,01,31,63,,,,MCP,,,,,False,,DAVIS,S,FORT STOCKTON,TX,79735,,5277,R,MAY DOUG,,P O BOX 250,,FT STOCKTON,TX,79735,0250,1.000000,0,0.00,H,,0.0000,LOCATED        MOBILE HOME,BLK 165        SEC 1,J CAMP,,0,0,0,0,0,0,0,0,23270,23270,0,0,0,0,0,0,0,0,0,23270,0,0,0,False,0,,,1,False,False,M1,,,,False,False,,
2019,00,PECOS COUNTY APPR DIST,89,00000-00000-03465-000000,18M,00,01,31,63,,,,MCP,,,,,False,,,,BAKERSFIELD,TX,,,5419,R,MC KENZIE LAND&LIVEST,LAZY 8 RANCH,HC 73   BOX 3,,MC CAMEY,TX,79752,,1.000000,0,0.00,,,0.0000,LOCATED        MOBILE HOME,BLK 21         SEC 21,UNIV LD,,0,0,0,0,0,0,0,0,6240,6240,0,0,0,0,0,0,0,0,0,0,0,6240,0,False,0,,,1,False,False,M1,,,,False,False,,
2019,00,PECOS COUNTY APPR DIST,93,00000-00318-00800-003571,18M,00,01,31,63,,,,MCP,,,,,False,227,BISHOP,E,FORT STOCKTON,TX,79735,,5634,R,MIRELES JOE & GLORIA,,P O BOX 1791,,FT STOCKTON,TX,79735,1791,1.000000,0,0.00,H,,0.0000,LOCATED    MOBILE HOME,TK -8,BODIE TOWN,,0,0,0,0,0,0,0,0,12130,12130,0,0,0,0,0,0,0,0,0,12130,0,0,0,False,0,,,1,False,False,M1,,,,False,False,,
2019,00,PECOS COUNTY APPR DIST,95,00117-00003-39000-003671,18M,00,01,31,63,,,,MCP,,,,,False,2692,TRAVIS,S,FORT STOCKTON,TX,79735,,3258,R,GOMEZ JERRY & ANNA,,P O BOX 602,,FT STOCKTON,TX,79735,0602,1.000000,0,0.00,,,0.0000,LOCATED MOBILE HOME,TK 39,ALAMO,,0,0,0,0,0,0,0,0,45030,45030,0,0,0,0,0,0,0,0,0,0,0,45030,0,False,0,,,1,False,False,M1,,,,False,False,,RANCH
2019,00,PECOS COUNTY APPR DIST,96,01680-00100-01000-003700,16M,00,01,31,10,63,,,MCP,,,,,False,735,US HWY 285,S,FORT STOCKTON,TX,79735,,28592,R,HOMER HOMES LLC,,735 S US HWY 285,,FORT STOCKTON,TX,79735,,1.000000,0,0.00,,,0.0000,LOCATED MOBILE HOME,ROAD RUNNER RV PARK,SPOT # 116,,0,0,0,0,0,0,0,0,4510,4510,0,0,0,0,0,0,0,0,0,0,0,4510,0,False,0,,,1,False,False,M1,,,,False,False,,SAN JACINTO
2019,00,PECOS COUNTY APPR DIST,98,00001-08002-05100-003720,18M,00,01,31,63,,,,MCP,,,,,False,,48 LANE,,FORT STOCKTON,TX,79735,,167,R,ALKA VIOLET,,1718 QUAIL RUN,,SAN MARCOS,TX,78666,9493,1.000000,0,0.00,,,0.0000,LOCATED   MOBILE HOME,TR 51,BLK 1 FSIL SEC 2,,0,0,0,0,0,0,0,0,4800,4800,0,0,0,0,0,0,0,0,0,4800,0,0,0,False,0,,,1,False,False,M1,,,,False,False,,
2019,00,PECOS COUNTY APPR DIST,104,00001-08010-00900-003820,18M,00,01,31,63,,,,MCP,,,,,False,5160,SULLIVAN,N,FORT STOCKTON,TX,79735,,8111,R,SULLIVAN REBA N,ELAINE NEATHERLIN,16148 N DALE WADE AVE,,GARDENDALE,TX,79758,,1.000000,0,0.00,,,0.0000,LOCATED   MOBILE HOME,TK-8,BLK 1 FSIL,,0,0,0,0,0,0,0,0,7890,7890,0,0,0,0,0,0,0,0,0,0,0,7890,0,False,0,,,1,False,False,M1,,,,False,False,,SEC 10
2019,00,PECOS COUNTY APPR DIST,107,01460-00100-12000-003849,18M,00,01,31,63,,,,MCP,,,,,False,1058,BLUEBIRD,,FORT STOCKTON,TX,79735,,6121,R,ORTEGA ISRAEL ETUX,IRMA ORTEGA,1058 BLUEBIRD,,FT STOCKTON,TX,79735,,1.000000,0,0.00,,,0.0000,LOCATED   RESIDENCE,12   MILLVIEW,,,0,0,0,0,0,0,0,0,49630,49630,0,0,0,0,0,0,0,0,0,0,0,49630,0,False,0,,,1,False,False,M1,,,,False,False,,
2019,00,PECOS COUNTY APPR DIST,113,00001-08015-04300-003891,18M,00,01,31,63,,,,MCP,,,,,False,,49 LANE,,FORT STOCKTON,TX,79735,,6208,R,PADILLA GERMAN,,1500 N ST GALL,,FT STOCKTON,TX,79735,2401,1.000000,0,0.00,H,,0.0000,LOCATED  MOBILE HOME,E/2-43,BLK 1 FSIL,,0,0,0,0,0,0,0,0,38740,38610,0,0,0,0,0,0,0,0,0,38740,0,0,0,False,0,,,1,False,False,M1,,,,False,False,,SEC 15
2019,00,PECOS COUNTY APPR DIST,116,00117-00003-14000-003897,18M,00,01,31,63,,,,MCP,,,,,False,2147,AUSTIN,S,FORT STOCKTON,TX,79735,,6421,R,PERRY CAROL,,PO BOX 578,,FORT STOCKTON,TX,79735,0578,1.000000,0,0.00,,,0.0000,LOCATED   MOBILE HOME,TK-14,ALAMO,,0,0,0,0,0,0,0,0,9260,9260,0,0,0,0,0,0,0,0,0,9260,0,0,0,False,0,,,1,False,False,M1,,,,False,False,,RANCH
2019,00,PECOS COUNTY APPR DIST,118,00001-08004-05800-003995,18M,00,01,31,63,,,,MCP,,,,,False,,51 LANE,,FORT STOCKTON,TX,79735,,6554,R,POTTER DARLENE,,606 N MISSOURI,,FT STOCKTON,TX,79735,9586,1.000000,0,0.00,,,0.0000,LOCATED        MOBILE HOME,BLK 1          FSIL,SEC 4          TR 58-59,,0,0,0,0,0,0,0,0,370,370,0,0,0,0,0,0,0,0,0,0,0,370,0,False,0,,,1,False,False,M1,,,,False,False,,
2019,00,PECOS COUNTY APPR DIST,121,01680-00100-01000-004060,16M,00,01,31,10,63,,,MCP,,,,,False,735,US HWY 285,S,FORT STOCKTON,TX,79735,,28592,R,HOMER HOMES LLC,,735 S US HWY 285,,FORT STOCKTON,TX,79735,,1.000000,0,0.00,,,0.0000,LOCATED MOBILE HOME,ROAD RUNNER RV PARK,SPOT # 5,,0,0,0,0,0,0,0,0,2230,2230,0,0,0,0,0,0,0,0,0,0,0,2230,0,False,0,,,1,False,False,M1,,,,False,False,,BRAZOS
2019,00,PECOS COUNTY APPR DIST,127,00117-00003-13000-004151,18M,00,01,31,63,,,,MCP,,,,,False,1307,ALAMO,W,FORT STOCKTON,TX,79735,,6829,R,RAWLS DALE,LARRY LUJAN,PO BOX 28,,FORT STOCKTON,TX,79735,,1.000000,0,0.00,,,0.0000,LOCATED    MOBILE HOME,TR-13,ALAMO,,0,0,0,0,0,0,0,0,3390,3390,0,0,0,0,0,0,0,0,0,3390,0,0,0,False,0,,,1,False,False,M1,,,,False,False,,RANCH
2019,00,PECOS COUNTY APPR DIST,129,00001-08009-01100-004301,18M,00,01,31,63,,,,MCP,,,,,False,,46 LANE,,FORT STOCKTON,TX,79735,,18633,R,JONAH INVESTMENT GROUP LLP,,1303 W DICKINSON,,FORT STOCKTON,TX,79735,,1.000000,0,0.00,,,0.0000,LOCATED MOBILE HOME,LUNING MH PARK,ROW 2 SP 1,,0,0,0,0,0,0,0,0,9370,9370,0,0,0,0,0,0,0,0,0,8690,0,680,0,False,0,,,1,False,False,M1,,,,False,False,,BLK 9 TR 25
2019,00,PECOS COUNTY APPR DIST,138,01180-00900-12000-004479,16M,00,01,31,10,63,,,MCP,,,,,False,1111,SCHLEGEL,N,FORT STOCKTON,TX,79735,,23510,R,REYES ANDRES,KARLA J AGUIRRE,4909 N STONE RD,,FORT STOCKTON,TX,79735,9047,1.000000,0,0.00,,,0.0000,LOCATED        MOBILE HOME,A&M MH PARK,LOT 12    SPACE 36,,0,0,0,0,0,0,0,0,12850,12850,0,0,0,0,0,0,0,0,0,12850,0,0,0,False,0,,,1,False,False,M1,,,,False,False,,
2019,00,PECOS COUNTY APPR DIST,150,01080-02600-31000-004840,16M,00,01,31,10,63,,,MCP,,,,,False,1405,SUNSET,N,FORT STOCKTON,TX,79735,,15225,R,HERNANDEZ MONICO A,,P O BOX 794,,FT STOCKTON,TX,79735,0794,1.000000,0,0.00,H,,0.0000,LOCATED  MOBILE HOME,"PT 1,2,3  BLK 26  BEVERLY SQ",SUNSET MH PARK,,0,0,0,0,0,0,0,0,9190,9190,0,0,0,0,0,0,0,0,0,9190,0,0,0,False,0,,,1,False,False,M1,,,,False,False,,SEE MAP
2019,00,PECOS COUNTY APPR DIST,153,00194-00002-00100-005038,24M,00,01,32,63,65,,,MCP,,,,,False,649,PRIVATE RD 8601,,IRAAN,TX,79744,,8461,R,TUCKER NELSON,,P O BOX 482,,IRAAN,TX,79744,0482,1.000000,0,0.00,H,,0.0000,LOCATED  MOBILE HOME,BLK 194 SEC 2,,,0,0,0,0,0,0,0,0,20190,20190,0,0,0,0,0,0,0,0,0,20190,0,0,0,False,0,,,1,False,False,M1,,,,False,False,,
2019,00,PECOS COUNTY APPR DIST,154,00001-08006-02100-005045,18M,00,01,31,63,,,,MCP,,,,,False,603,47 LANE,W,FORT STOCKTON,TX,79735,,8469,R,TURMAN H D,,603 W 47TH LANE,,FT STOCKTON,TX,79735,9526,1.000000,0,0.00,H,,0.0000,LOCATED        MOBILE HOME,FSIL,BLK 1       SEC 6 TR 21,,0,0,0,0,0,0,0,0,6050,6050,0,0,0,0,0,0,0,0,0,6050,0,0,0,False,0,,,1,False,False,M1,,,,False,False,,
2019,00,PECOS COUNTY APPR DIST,160,02100-01600-10000-005169,21M,00,01,32,12,63,65,,MCP,,,,,False,,FIFTH,,IRAAN,TX,79744,,5226,R,MARTINEZ MANUEL,JOANNA BARRERA,PO BOX 1202,,IRAAN,TX,79744,,1.000000,0,0.00,,,0.0000,LOCATED    MOBILE HOME,LOT 10,BLK 16,,0,0,0,0,0,0,0,0,7070,7070,0,0,0,0,0,0,0,0,0,7070,0,0,0,False,0,,,1,False,False,M1,,,,False,False,,IRRAN
2019,00,PECOS COUNTY APPR DIST,163,00016-00022-00100-005431,24M,00,01,32,63,65,,,MCP,,,,,False,,,,,,,,24679,R,WOODWARD ERNEST RANCHES LTD,,HC 73 BOX 29,,MC CAMEY,TX,79752,,1.000000,0,0.00,,,0.0000,LOCATED        MOBILE HOME,BLK 16         SEC 22,UNV LD,,0,0,0,0,0,0,0,0,27220,27220,0,0,0,0,0,0,0,0,0,0,0,27220,0,False,0,,,1,False,False,M1,,,,False,False,,
2019,00,PECOS COUNTY APPR DIST,166,02100-00200-09000-005462,21M,00,01,32,12,63,65,,MCP,,,,,False,307,SEVENTH,,IRAAN,TX,79744,,7447,R,RICO JUAN,,P O BOX 521,,IRAAN,TX,79744,0521,1.000000,0,0.00,,,0.0000,LOCATED MOBILE HOME,SPT -9,BLK 2,,0,0,0,0,0,0,0,0,5010,5010,0,0,0,0,0,0,0,0,0,0,0,5010,0,False,0,,,1,False,False,M1,,,,False,False,,IRAAN
2019,00,PECOS COUNTY APPR DIST,169,01460-01700-11000-009402,18M,00,01,31,63,,,,MCP,,,,,False,1397,KILLDEER,,FORT STOCKTON,TX,79735,,17975,R,ORTEGA RUPERTO,,1397 KILDEER LN,,FORT STOCKTON,TX,79735,9443,1.000000,0,0.00,H,,0.0000,LOCATED  RES ONLY,W 200f-11,BLK 17,,0,0,0,0,0,0,0,0,52160,52160,0,0,0,0,0,0,0,0,0,52160,0,0,0,False,0,,,1,False,False,A1,,,,False,False,,MESA VIEW
2019,00,PECOS COUNTY APPR DIST,173,00146-00017-02700-009408,18M,00,01,31,63,,,,MCP,,,,,False,798,40 LANE,,FORT STOCKTON,TX,79735,,1311,R,CARRILLO OSCAR,,P O BOX 1755,,FT STOCKTON,TX,79735,1755,1.000000,0,0.00,H,,0.0000,LOCATED        MOBILE HOME,NPT-27,BLK 146,,0,0,0,0,0,0,0,0,6360,6360,0,0,0,0,0,0,0,0,0,6360,0,0,0,False,0,,,1,False,False,M1,,,,False,False,,SEC 17     LITTLE MEXICO
2019,00,PECOS COUNTY APPR DIST,174,00146-00017-02800-009409,18M,00,01,31,63,,,,MCP,,,,,False,,40 LANE,,FORT STOCKTON,TX,79735,,6605,R,PRIMERA PAT,NOEMI PRIMERA,P O BOX 492,,FT STOCKTON,TX,79735,0492,1.000000,0,0.00,,,0.0000,LOCATED    MOBILE HOME,NPT 28B,BLK 146,,0,0,0,0,0,0,0,0,11130,11130,0,0,0,0,0,0,0,0,0,0,0,11130,0,False,0,,,1,False,False,M1,,,,False,False,,SEC 17     LITTLE MEXICO
2019,00,PECOS COUNTY APPR DIST,179,00146-00017-07000-009419,18M,00,01,31,63,,,,MCP,,,,,False,,42 LANE,,FORT STOCKTON,TX,79735,,26,R,ACOSTA JAMIE & LAZARO S,,624 WEST 42ND LANE,,FT STOCKTON,TX,79735,8960,1.000000,0,0.00,,,0.0000,LOCATED   MOBILE HOME,NE COR-7,BLK 146,,0,0,0,0,0,0,0,0,2390,2390,0,0,0,0,0,0,0,0,0,2390,0,0,0,False,0,,,1,False,False,M1,,,,False,False,,SEC 17     LITTLE MEXICO
2019,00,PECOS COUNTY APPR DIST,183,01680-00100-01000-009426,16M,00,01,31,10,63,,,MCP,,,,,False,735,US HWY 285,S,FORT STOCKTON,TX,79735,,28592,R,HOMER HOMES LLC,,735 S US HWY 285,,FORT STOCKTON,TX,79735,,1.000000,0,0.00,,,0.0000,LOCATED MOBILE HOME,ROAD RUNNER RV PARK,SPOT #26,,0,0,0,0,0,0,0,0,19430,19430,0,0,0,0,0,0,0,0,0,19430,0,0,0,False,0,,,1,False,False,M1,,,,False,False,,JOSHUA
2019,00,PECOS COUNTY APPR DIST,184,01680-00100-01000-009429,16M,00,01,31,10,63,,,MCP,,,,,False,735,US HWY 285,S,FORT STOCKTON,TX,79735,,28592,R,HOMER HOMES LLC,,735 S US HWY 285,,FORT STOCKTON,TX,79735,,1.000000,0,0.00,,,0.0000,LOCATED MOBILE HOME,ROAD RUNNER RV PARK,SPOT #23,,0,0,0,0,0,0,0,0,3260,3260,0,0,0,0,0,0,0,0,0,0,0,3260,0,False,0,,,1,False,False,M1,,,,False,False,,JOSHUA
2019,00,PECOS COUNTY APPR DIST,186,02100-00200-09000-009438,21M,00,01,32,12,63,65,,MCP,,,,,False,,SEVENTH,,IRAAN,TX,79744,,6976,R,RICO JUAN ETUX MARIA,,P O BOX 521,,IRAAN,TX,79744,0521,1.000000,0,0.00,,,0.0000,LOCATED        MOBILE HOME,NPT-9          BLK 2,IRAAN,,0,0,0,0,0,0,0,0,860,860,0,0,0,0,0,0,0,0,0,0,0,860,0,False,0,,,1,False,False,M1,,,,False,False,,
2019,00,PECOS COUNTY APPR DIST,191,00194-00069-00100-009448,24M,00,01,32,63,65,,,MCP,,,,,False,7420,CO-OP RD,,,,,,28344,R,SCHNEEMANN STEPHEN CADE,,P O BOX 523,,IRAAN,TX,79744,,1.000000,0,0.00,,,0.0000,LOCATED        MOBILE HOME,BLK 194     SEC 69,,,0,0,0,0,0,0,0,0,55730,55730,0,0,0,0,0,0,0,0,0,55730,0,0,0,False,0,,,1,False,False,M1,,,,False,False,,
2019,00,PECOS COUNTY APPR DIST,192,02120-03900-03000-009450,11M,00,01,13,32,63,65,,MCP,,,,,False,,AVE I,,SHEFFIELD,TX,79781,,3455,R,GRAHAM JOHN ALLEN,,P O BOX 427,,SHEFFIELD,TX,79781,0427,1.000000,0,0.00,H,,0.0000,LOCATED   MOBILE HOME,3 & 4,BLK 39,,0,0,0,0,0,0,0,0,43150,43150,0,0,0,0,0,0,0,0,0,43150,0,0,0,False,0,,,1,False,False,M1,,,,False,False,,SHEFFIELD
2019,00,PECOS COUNTY APPR DIST,197,00000-00318-01600-009506,18M,00,01,31,63,,,,MCP,,,,,False,351,SMITH,E,FORT STOCKTON,TX,79735,,4245,R,IBARRA CARLOS,,P O BOX 813,,FT STOCKTON,TX,79735,0813,1.000000,0,0.00,,,0.0000,LOCATED    MOBILE HOME,16   C       BODIE TOWN,,,0,0,0,0,0,0,0,0,1650,1650,0,0,0,0,0,0,0,0,0,0,0,1650,0,False,0,,,1,False,False,M1,,,,False,False,,
2019,00,PECOS COUNTY APPR DIST,208,01680-00100-01000-009521,16M,00,01,31,10,63,,,MCP,,,,,False,735,US HWY 285,S,FORT STOCKTON,TX,79735,,26516,R,GRANILLO JAIME,,735  S  US 285 R 11 S 11,,FORT STOCKTON,TX,79735,,1.000000,0,0.00,,,0.0000,LOCATED MOBILE HOME,ROAD RUNNER RV PARK,SPOT # 110,,0,0,0,0,0,0,0,0,4480,4480,0,0,0,0,0,0,0,0,0,4480,0,0,0,False,0,,,1,False,False,M1,,,,False,False,,SAN JACINTO
2019,00,PECOS COUNTY APPR DIST,213,01680-00100-01000-009531,16M,00,01,31,10,63,,,MCP,,,,,False,735,US HWY 285,S,FORT STOCKTON,TX,79735,,28592,R,HOMER HOMES LLC,,735 S US HWY 285,,FORT STOCKTON,TX,79735,,1.000000,0,0.00,,,0.0000,LOCATED MOBILE HOME,ROAD RUNNER RV PARK,SPOT #33,,0,0,0,0,0,0,0,0,2160,2160,0,0,0,0,0,0,0,0,0,0,0,2160,0,False,0,,,1,False,False,M1,,,,False,False,,JOSHUA
2019,00,PECOS COUNTY APPR DIST,217,00000-00000-09537-000000,18M,00,01,31,63,,,,MCP,,,,,False,,MENDEL,,FORT STOCKTON,TX,79735,,5617,R,MILLER SAM,FREDDY PIERCE,P O BOX 1389,,**UNKNOWN***,,,,1.000000,0,0.00,,,0.0000,LOCATED        MOBILE HOMES,48-9           T&P,SEC 30,,0,0,0,0,0,0,0,0,1080,1080,0,0,0,0,0,0,0,0,0,0,0,1080,0,False,0,,,1,False,False,M1,,,,False,False,,
2019,00,PECOS COUNTY APPR DIST,218,00135-00026-01000-009538,18M,00,01,31,63,,,,MCP,,,,,False,,,,,,,,4604,R,KINCAID T C JR,,P O BOX 1371,,FT STOCKTON,TX,79735,,1.000000,0,0.00,,,0.0000,LOCATED        MOBILE HOME,BLK 135       SEC 26,,,0,0,0,0,0,0,0,0,3520,3520,0,0,0,0,0,0,0,0,0,0,0,3520,0,False,0,,,1,False,False,M1,,,,False,False,,
2019,00,PECOS COUNTY APPR DIST,222,00194-00074-00100-009545,24M,00,01,32,63,65,,,MCP,,,,,False,1212,HWY 1901,,,,,,3845,R,HEINEN ELLEN L,,P O BOX 326,,MC CAMEY,TX,79752,0326,1.000000,0,0.00,H,,0.0000,LOCATED MOBILE HOME,5350  194  GC&SF  SEC 74,,,0,0,0,0,0,0,0,0,9660,9660,0,0,0,0,0,0,0,0,0,9660,0,0,0,False,0,,,1,False,False,M1,,,,False,False,,
2019,00,PECOS COUNTY APPR DIST,225,02100-00300-08000-009549,21M,00,01,32,12,63,65,,MCP,,,,,False,204B,SEVENTH,W,IRAAN,TX,79744,,5764,R,MORALES SANTOS,,P O BOX 704,,IRAAN,TX,79744,0704,1.000000,0,0.00,,,0.0000,LOCATED        MOBILE HOME,NPT-8,BLK 3,,0,0,0,0,0,0,0,0,2120,2120,0,0,0,0,0,0,0,0,0,0,0,2120,0,False,0,,,1,False,False,M1,,,,False,False,,IRAAN
2019,00,PECOS COUNTY APPR DIST,227,02100-00700-01000-009551,21M,00,01,32,12,63,65,,MCP,,,,,False,306,EIGHTH,,IRAAN,TX,79744,,8460,R,STEPHENS LANELLE,,P O BOX 643,,IRAAN,TX,79744,0643,1.000000,0,0.00,H,,0.0000,LOCATED        MOBILE HOME,S/PT 2-5     SP 1,BLK 7,,0,0,0,0,0,0,0,0,19440,19440,0,0,0,0,0,0,0,0,0,19440,0,0,0,False,0,,,1,False,False,M1,,,,False,False,,IRAAN
2019,00,PECOS COUNTY APPR DIST,230,02131-01000-20000-009559,11M,00,01,13,32,63,65,,MCP,,,,,False,,LOUISIANA,,SHEFFIELD,TX,79781,,27893,R,CARSON CHRIS,,1307 NW 12TH STREET,,ANDREWS,TX,79714,,1.000000,0,0.00,,,0.0000,LOCATED   MOBILE HOME,LOT 17-20,BLK 10,,0,0,0,0,0,0,0,0,14040,14040,0,0,0,0,0,0,0,0,0,0,0,14040,0,False,0,,,1,False,False,M1,,,,False,False,,AUTERY